BDBM50009034 2-(4-Ethylsulfanyl-3-methyl-pyridin-2-ylmethanesulfinyl)-1-(2-piperidin-1-yl-ethyl)-1H-benzoimidazole::CHEMBL9842
SMILES CCSc1ccnc(CS(=O)c2nc3ccccc3n2CCN2CCCCC2)c1C
InChI Key InChIKey=NTKKYYXVVRAMIR-UHFFFAOYSA-N
Data  1 IC50
  Tab Delimited (TSV)   2D SDfile   Computed 3D by Vconf -m prep SDfile
Find this compound or compounds like it in BindingDB:
Activity Spreadsheet -- Enzyme Inhibition Constant Data from BindingDB
Found 1 hit for monomerid = 50009034
LigandPNGBDBM50009034(2-(4-Ethylsulfanyl-3-methyl-pyridin-2-ylmethanesul...)
Affinity DataIC50:  3.00E+4nM. Assay description: Activity was evaluated by measuring the inhibition of isolated hog H+/K+ ATPase
In DepthDetails ArticlePubMed