BDBM50009087 CHEMBL3237989
SMILES CNC(=O)c1ccc(cc1)N1CCN(C[C@@H]1C#CC)S(=O)(=O)c1ccc(N)nc1
InChI Key InChIKey=VBFKMJNRBZRSID-KRWDZBQOSA-N
Data  1 IC50  1 EC50
  Tab Delimited (TSV)   2D SDfile   Computed 3D by Vconf -m prep SDfile
Find this compound or compounds like it in BindingDB:
Activity Spreadsheet -- Enzyme Inhibition Constant Data from BindingDB
Found 2 hits for monomerid = 50009087
TargetGlucokinase regulatory protein(Mus musculus)
Amgen
Curated by ChEMBL
LigandPNGBDBM50009087(CHEMBL3237989)
Affinity DataEC50:  4.05E+3nM. Assay description: Inhibition of GKRP-GK interaction in mouse hepatocytes assessed as induction of GK translocation from nucleus to cytoplasm incubated for 20 mins prio...
In DepthDetails ArticlePubMed
TargetGlucokinase regulatory protein(Homo sapiens (Human))
Amgen
Curated by ChEMBL
LigandPNGBDBM50009087(CHEMBL3237989)
Affinity DataIC50:  3.07E+3nM. Assay description: Inhibition of biotin-tagged human GKRP/fluorescein-tagged GK interaction preincubated for 20 mins prior to GK addition measured after 2 to 4 hrs by A...
In DepthDetails ArticlePubMed