BDBM50009131 4-Amino-3-(2,4-dichloro-phenyl)-butyric acid; hydrochloride::CHEMBL538722
SMILES NCC(CC(O)=O)c1ccc(Cl)cc1Cl
InChI Key InChIKey=WFQVWAWOBXGOKM-UHFFFAOYSA-N
Data  1 IC50
  Tab Delimited (TSV)   2D SDfile   Computed 3D by Vconf -m prep SDfile
Find this compound or compounds like it in BindingDB:
Activity Spreadsheet -- Enzyme Inhibition Constant Data from BindingDB
Found 1 hit for monomerid = 50009131
TargetGamma-aminobutyric acid type B receptor subunit 1/2(Rattus norvegicus (Rat))
Centre De Neurochimie Du Cnrs
Curated by ChEMBL
LigandPNGBDBM50009131(4-Amino-3-(2,4-dichloro-phenyl)-butyric acid; hydr...)
Affinity DataIC50:  1.10E+4nM. Assay description: Displacement of [3H]baclofen from gamma-aminobutyric-acid B receptor
In DepthDetails ArticlePubMed