BDBM50009298 CHEMBL3233521
SMILES COc1nc(OCCF)nc(OC)c1NC(=O)c1ccc(Oc2cc3c(CCC3(C)C)cc2C)o1
InChI Key InChIKey=PVGVKMIGQPWHEG-UHFFFAOYSA-N
Data  1 KI
  Tab Delimited (TSV)   2D SDfile   Computed 3D by Vconf -m prep SDfile
Find this compound or compounds like it in BindingDB:
Activity Spreadsheet -- Enzyme Inhibition Constant Data from BindingDB
Found 1 hit for monomerid = 50009298
TargetGonadotropin-releasing hormone receptor(Rattus norvegicus)
Norwegian Medical Cyclotron Centre
Curated by ChEMBL
LigandPNGBDBM50009298(CHEMBL3233521)
Affinity DataKi:  1.40nM. Assay description: Displacement of [125I]Triptorelin from rat full-length gonadotropin-releasing hormone receptor expressed in HEK293 cells
In DepthDetails ArticlePubMed