BDBM50009352 CHEMBL3233572
SMILES O=C(CNC(=O)c1ccnc2[nH]ccc12)N1CCC[C@H]1C#N
InChI Key InChIKey=VLLQATRRTWXIFV-JTQLQIEISA-N
Data  4 IC50
  Tab Delimited (TSV)   2D SDfile   Computed 3D by Vconf -m prep SDfile
Find this compound or compounds like it in BindingDB:
Activity Spreadsheet -- Enzyme Inhibition Constant Data from BindingDB
Found 4 hits for monomerid = 50009352
TargetDipeptidyl peptidase 2(Homo sapiens (Human))
University Of Antwerp
Curated by ChEMBL
LigandPNGBDBM50009352(CHEMBL3233572)
Affinity DataIC50: >1.00E+5nM. Assay description: Inhibition of DPP2 purified from human seminal plasma using Lys-Ala-p-nitroanilide as substrate by spectrophotometry
In DepthDetails ArticlePubMed
TargetProlyl endopeptidase(Homo sapiens (Human))
University Of Antwerp
Curated by ChEMBL
LigandPNGBDBM50009352(CHEMBL3233572)
Affinity DataIC50:  2.70E+3nM. Assay description: Inhibition of recombinant human PREP purified from Escherichia coli using Z-Gly-Pro-p-nitroanilide as substrate by spectrophotometry
In DepthDetails ArticlePubMed
TargetProlyl endopeptidase FAP(Mus musculus (Mouse))
University Of Antwerp
Curated by ChEMBL
LigandPNGBDBM50009352(CHEMBL3233572)
Affinity DataIC50:  40nM. Assay description: Inhibition of recombinant mouse FAP purified from HEK293 cell supernatant using Ala-Pro-p-nitroanilide as substrate by spectrophotometry
In DepthDetails ArticlePubMed
TargetDipeptidyl peptidase 4(Homo sapiens (Human))
University Of Antwerp
Curated by ChEMBL
LigandPNGBDBM50009352(CHEMBL3233572)
Affinity DataIC50: >1.00E+5nM. Assay description: Inhibition of DPP4 purified from human seminal plasma using Gly-Pro-p-nitroanilide as substrate by spectrophotometry
In DepthDetails ArticlePubMed