BDBM50009439 CHEMBL3233885
SMILES OC(=O)C[C@H]1CC[C@@H](CC1)c1ccc(cc1)-c1ccc2c(cccc2c1)C(=O)Nc1ccccc1
InChI Key InChIKey=XVUFVZWOVPVTGF-HZCBDIJESA-N
Data  2 IC50
  Tab Delimited (TSV)   2D SDfile   Computed 3D by Vconf -m prep SDfile
Find this compound or compounds like it in BindingDB:
Activity Spreadsheet -- Enzyme Inhibition Constant Data from BindingDB
Found 2 hits for monomerid = 50009439
TargetDiacylglycerol O-acyltransferase 1(Mus musculus (mouse))
Merck Research Laboratories
Curated by ChEMBL
LigandPNGBDBM50009439(CHEMBL3233885)
Affinity DataIC50:  8nM. Assay description: Inhibition of mouse DGAT1
In DepthDetails ArticlePubMed
TargetDiacylglycerol O-acyltransferase 1(Homo sapiens (Human))
Merck Research Laboratories
Curated by ChEMBL
LigandPNGBDBM50009439(CHEMBL3233885)
Affinity DataIC50:  11nM. Assay description: Inhibition of human DGAT1
In DepthDetails ArticlePubMed