BDBM50009444 CHEMBL3233888
SMILES Cc1cc(C(=O)Nc2ccccc2)c2ccc(cc2n1)-c1ccc(cc1)[C@H]1CC[C@H](CC(O)=O)CC1
InChI Key InChIKey=DWNZVBRWWMFCAO-HZCBDIJESA-N
Data  3 IC50
  Tab Delimited (TSV)   2D SDfile   Computed 3D by Vconf -m prep SDfile
Find this compound or compounds like it in BindingDB:
Activity Spreadsheet -- Enzyme Inhibition Constant Data from BindingDB
Found 3 hits for monomerid = 50009444
TargetDiacylglycerol O-acyltransferase 1(Homo sapiens (Human))
Merck Research Laboratories
Curated by ChEMBL
LigandPNGBDBM50009444(CHEMBL3233888)
Affinity DataIC50:  28nM. Assay description: Inhibition of human DGAT1
In DepthDetails ArticlePubMed
TargetDiacylglycerol O-acyltransferase 1(Mus musculus (mouse))
Merck Research Laboratories
Curated by ChEMBL
LigandPNGBDBM50009444(CHEMBL3233888)
Affinity DataIC50:  10nM. Assay description: Inhibition of mouse DGAT1
In DepthDetails ArticlePubMed
TargetSterol O-acyltransferase 2(Homo sapiens (Human))
Merck Research Laboratories
Curated by ChEMBL
LigandPNGBDBM50009444(CHEMBL3233888)
Affinity DataIC50:  1.10E+3nM. Assay description: Inhibition of human ACAT2
In DepthDetails ArticlePubMed