BDBM50009557 CHEMBL3234451
SMILES CCN(CC)c1ccc2c(-c3ccc(cc3S([O-])(=O)=O)S(=O)(=O)NCCCCCCCCCCCCNC(=O)NCCCC[C@H](NC(=O)Cc3csc(=N)[nH]3)C(=O)N[C@@H](Cc3cn(Cc4ccccc4)c[nH+]3)C(=O)NC3CC[NH+](C)CC3)c3ccc(cc3oc2c1)=[N+](CC)CC
InChI Key InChIKey=MZSXCOUMVALANT-OBXNHJGZSA-P
Data  1 KI
  Tab Delimited (TSV)   2D SDfile   Computed 3D by Vconf -m prep SDfile
Find this compound or compounds like it in BindingDB:
Activity Spreadsheet -- Enzyme Inhibition Constant Data from BindingDB
Found 1 hit for monomerid = 50009557
TargetApelin(Homo sapiens (Human))
University Of Strasburg
Curated by ChEMBL
LigandPNGBDBM50009557(CHEMBL3234451)
Affinity DataKi:  9.00E+3nM. Assay description: Displacement of [125I]-pE13F from human apelin receptor expressed in CHO cell membranes after 1 hr by gamma counting analysis
In DepthDetails ArticlePubMed