BDBM50009809 CHEMBL283984::[3-(6-Methoxy-benzothiazol-2-ylmethyl)-4-oxo-3,4-dihydro-phthalazin-1-yl]-acetic acid
SMILES COc1ccc2nc(Cn3nc(CC(O)=O)c4ccccc4c3=O)sc2c1
InChI Key InChIKey=XKMRTYNPAFDESO-UHFFFAOYSA-N
Data  1 IC50
  Tab Delimited (TSV)   2D SDfile   Computed 3D by Vconf -m prep SDfile
Find this compound or compounds like it in BindingDB:
Activity Spreadsheet -- Enzyme Inhibition Constant Data from BindingDB
Found 1 hit for monomerid = 50009809
TargetAldo-keto reductase family 1 member B1(Homo sapiens (Human))
Pfizer
Curated by ChEMBL
LigandPNGBDBM50009809(CHEMBL283984 | [3-(6-Methoxy-benzothiazol-2-ylmeth...)
Affinity DataIC50:  4.20E+3nM. Assay description: Inhibition of aldose reductase (aldo-keto reductase, AKR1B1) isolated from human placenta.
In DepthDetails ArticlePubMed