BDBM50009851 4-Hydroxy-1-(4-methoxy-benzyl)-5-oxo-2,5-dihydro-1H-pyrrole-3-carboxylic acid ethyl ester::CHEMBL414208
SMILES CCOC(=O)C1CN(Cc2ccc(OC)cc2)C(=O)C1=O
InChI Key InChIKey=LJQQOJOCWYMZEW-UHFFFAOYSA-N
Data  1 IC50
  Tab Delimited (TSV)   2D SDfile   Computed 3D by Vconf -m prep SDfile
Find this compound or compounds like it in BindingDB:
Activity Spreadsheet -- Enzyme Inhibition Constant Data from BindingDB
Found 1 hit for monomerid = 50009851
TargetAldo-keto reductase family 1 member B1(Homo sapiens (Human))
Pfizer
Curated by ChEMBL
LigandPNGBDBM50009851(4-Hydroxy-1-(4-methoxy-benzyl)-5-oxo-2,5-dihydro-1...)
Affinity DataIC50:  410nM. Assay description: In vitro inhibition of human placental aldose reductase.Checked by Author
In DepthDetails ArticlePubMed