BDBM50009883 6-(3-Methyl-thioureido)-2-(3-naphthalen-1-yl-2-naphthalen-1-ylmethyl-propionylamino)-hexanoic acid {4-[2-(2-amino-ethyl)-morpholin-4-yl]-1-cyclohexylmethyl-2-hydroxy-4-oxo-butyl}-amide::CHEMBL279715
SMILES CNC(=S)NCCCCC(NC(=O)C(Cc1cccc2ccccc12)Cc1cccc2ccccc12)C(=O)NC(CC1CCCCC1)[C@@H](O)CC(=O)N1CCOC(CCN)C1
InChI Key InChIKey=FYFHLIBWNYHITO-BNRLSTEOSA-N
Data  1 IC50
  Tab Delimited (TSV)   2D SDfile   Computed 3D by Vconf -m prep SDfile
Find this compound or compounds like it in BindingDB:
Activity Spreadsheet -- Enzyme Inhibition Constant Data from BindingDB
Found 1 hit for monomerid = 50009883
TargetRenin(Homo sapiens (Human))
Warner-Lambert
Curated by ChEMBL
LigandPNGBDBM50009883(6-(3-Methyl-thioureido)-2-(3-naphthalen-1-yl-2-nap...)
Affinity DataIC50:  29nM. Assay description: Inhibitory activity against monkey plasma renin.
In DepthDetails ArticlePubMed