BDBM50009890 1N-(1-benzylcarbamoyl-3-methylbutyl)-4-{5-amino(cyano)(imino)methylamino-1-[2-(1-naphthyl)-1-(1-naphthylmethyl)ethylcarboxamido]pentylcarboxamido}-3-hydroxy-6-methyl-(3S,4R)-heptanamide::CHEMBL281366
SMILES CC(C)CC(NC(=O)C(CCCCNC(=N)N[N+]([O-])=O)NC(=O)C(Cc1cccc2ccccc12)Cc1cccc2ccccc12)[C@@H](O)CC(=O)NC(CC(C)C)C(=O)NCc1ccccc1
InChI Key InChIKey=KYSFAXUWAVUDOY-YONJSIODSA-N
Data  2 IC50
  Tab Delimited (TSV)   2D SDfile   Computed 3D by Vconf -m prep SDfile
Find this compound or compounds like it in BindingDB:
Activity Spreadsheet -- Enzyme Inhibition Constant Data from BindingDB
Found 2 hits for monomerid = 50009890
TargetRenin(Homo sapiens (Human))
Warner-Lambert
Curated by ChEMBL
LigandPNGBDBM50009890(1N-(1-benzylcarbamoyl-3-methylbutyl)-4-{5-amino(cy...)
Affinity DataIC50:  15nM. Assay description: Inhibitory activity against human plasma renin
In DepthDetails ArticlePubMed
TargetRenin(Homo sapiens (Human))
Warner-Lambert
Curated by ChEMBL
LigandPNGBDBM50009890(1N-(1-benzylcarbamoyl-3-methylbutyl)-4-{5-amino(cy...)
Affinity DataIC50:  49nM. Assay description: Inhibitory activity against human plasma renin
In DepthDetails ArticlePubMed