BDBM50009895 6-(3-Methyl-thioureido)-2-(3-naphthalen-1-yl-2-naphthalen-1-ylmethyl-propionylamino)-hexanoic acid {4-[2-(2-amino-ethyl)-morpholin-4-yl]-3,3-difluoro-2-hydroxy-1-isobutyl-4-oxo-butyl}-amide::CHEMBL23920
SMILES CNC(=S)NCCCCC(NC(=O)C(Cc1cccc2ccccc12)Cc1cccc2ccccc12)C(=O)NC(CC(C)C)[C@@H](O)C(F)(F)C(=O)N1CCOC(CCN)C1
InChI Key InChIKey=ZRRTXYZBNRRMDM-KFKRJCRXSA-N
Data  1 IC50
  Tab Delimited (TSV)   2D SDfile   Computed 3D by Vconf -m prep SDfile
Find this compound or compounds like it in BindingDB:
Activity Spreadsheet -- Enzyme Inhibition Constant Data from BindingDB
Found 1 hit for monomerid = 50009895
TargetRenin(Homo sapiens (Human))
Warner-Lambert
Curated by ChEMBL
LigandPNGBDBM50009895(6-(3-Methyl-thioureido)-2-(3-naphthalen-1-yl-2-nap...)
Affinity DataIC50:  350nM. Assay description: Inhibitory activity against monkey plasma renin.
In DepthDetails ArticlePubMed