BDBM50009946 1-(4-Hydroxy-phenyl)-4-(2-methoxy-ethyl)-pyrazolidin-3-one::CHEMBL431315
SMILES COCCC1CN(NC1=O)c1ccc(O)cc1
InChI Key InChIKey=FWYBLFKATYULQX-UHFFFAOYSA-N
Data  1 IC50
  Tab Delimited (TSV)   2D SDfile   Computed 3D by Vconf -m prep SDfile
Find this compound or compounds like it in BindingDB:
Activity Spreadsheet -- Enzyme Inhibition Constant Data from BindingDB
Found 1 hit for monomerid = 50009946
TargetPolyunsaturated fatty acid 5-lipoxygenase(Rattus norvegicus)
Sterling Research Group
Curated by ChEMBL
LigandPNGBDBM50009946(1-(4-Hydroxy-phenyl)-4-(2-methoxy-ethyl)-pyrazolid...)
Affinity DataIC50:  5.13E+3nM. Assay description: In vitro inhibition of rat 5-Lipoxygenase
In DepthDetails ArticlePubMed