BDBM50010080 CHEMBL3245395
SMILES NC(=N)c1ccc(COc2cccc(c2)C(F)(F)F)cc1
InChI Key InChIKey=GNUXLXIGBAEFTB-UHFFFAOYSA-N
Data  1 KI
  Tab Delimited (TSV)   2D SDfile   Computed 3D by Vconf -m prep SDfile
Find this compound or compounds like it in BindingDB:
Activity Spreadsheet -- Enzyme Inhibition Constant Data from BindingDB
Found 1 hit for monomerid = 50010080
TargetAcrosin(Sus scrofa)
TBA
Curated by ChEMBL
LigandPNGBDBM50010080(CHEMBL3245395)
Affinity DataKi:  1.70E+3nM. Assay description: Reversible competitive inhibition of boar spermatozoa acrosin using BzArgOEt as substrate by Dixon plot analysis
In DepthDetails ArticlePubMed