BDBM50010113 CHEMBL3245402
SMILES NC(=N)c1ccc(OCCCCCOc2ccccc2)cc1
InChI Key InChIKey=QIDZISRKOLZRFJ-UHFFFAOYSA-N
Data  1 KI
  Tab Delimited (TSV)   2D SDfile   Computed 3D by Vconf -m prep SDfile
Find this compound or compounds like it in BindingDB:
Activity Spreadsheet -- Enzyme Inhibition Constant Data from BindingDB
Found 1 hit for monomerid = 50010113
TargetAcrosin(Sus scrofa)
TBA
Curated by ChEMBL
LigandPNGBDBM50010113(CHEMBL3245402)
Affinity DataKi:  280nM. Assay description: Reversible competitive inhibition of boar spermatozoa acrosin using BzArgOEt as substrate by Dixon plot analysis
In DepthDetails ArticlePubMed