BDBM50010151 6-(2-Butyl-4-chloro-5-hydroxymethyl-imidazol-1-ylmethyl)-2-methyl-1,2,3,4-tetrahydro-naphthalene-2-carboxylic acid::CHEMBL107271
SMILES CCCCc1nc(Cl)c(CO)n1Cc1ccc2CC(C)(CCc2c1)C(O)=O
InChI Key InChIKey=MIKKFRRWKWWJCI-UHFFFAOYSA-N
Data  1 IC50
  Tab Delimited (TSV)   2D SDfile   Computed 3D by Vconf -m prep SDfile
Find this compound or compounds like it in BindingDB:
Activity Spreadsheet -- Enzyme Inhibition Constant Data from BindingDB
Found 1 hit for monomerid = 50010151
TargetType-1 angiotensin II receptor B(RAT)
Ciba-Geigy
Curated by ChEMBL
LigandPNGBDBM50010151(6-(2-Butyl-4-chloro-5-hydroxymethyl-imidazol-1-ylm...)
Affinity DataIC50:  4.60E+3nM. Assay description: Binding affinity against angiotensin II receptor in rat smooth muscle cell preparations
In DepthDetails ArticlePubMed