BDBM50010193 CHEMBL2370407::[16-Acetylamino-4-carbamoyl-13-(3-guanidino-propyl)-3,3,14,17,17-pentamethyl-6,9,12,15-tetraoxo-1,2-dithia-5,8,11,14-tetraaza-cycloheptadec-7-yl]-acetic acid
SMILES [#6]-[#7]-1-[#6@@H](-[#6]-[#6]-[#6]\[#7]=[#6](\[#7])-[#7])-[#6](=O)-[#7]-[#6]-[#6](=O)-[#7]-[#6@@H](-[#6]-[#6](-[#8])=O)-[#6](=O)-[#7]-[#6@@H](-[#6](-[#7])=O)C([#6])([#6])[#16]-[#16]C([#6])([#6])[#6@@H](-[#7]-[#6](-[#6])=O)-[#6]-1=O
InChI Key InChIKey=FTNKTQMIRUQUMO-USJZOSNVSA-N
Data  1 IC50
  Tab Delimited (TSV)   2D SDfile   Computed 3D by Vconf -m prep SDfile
Find this compound or compounds like it in BindingDB:
Activity Spreadsheet -- Enzyme Inhibition Constant Data from BindingDB
Found 1 hit for monomerid = 50010193
TargetIntegrin alpha-IIb/beta-3(Homo sapiens (Human))
Smithkline Beecham Pharmaceuticals Research And Development
Curated by ChEMBL
LigandPNGBDBM50010193(CHEMBL2370407 | [16-Acetylamino-4-carbamoyl-13-(3-...)
Affinity DataIC50:  370nM. Assay description: Inhibition of canine platelet-rich plasma agregation induced by ADP
In DepthDetails ArticlePubMed