BDBM50010358 CHEMBL3263602
SMILES CCNC(=O)Nc1nc2cc(-c3cncnc3)c(nc2s1)N1CCOCC1
InChI Key InChIKey=ZERPWIHGOJSFAO-UHFFFAOYSA-N
Data  1 IC50
  Tab Delimited (TSV)   2D SDfile   Computed 3D by Vconf -m prep SDfile
Find this compound or compounds like it in BindingDB:
Activity Spreadsheet -- Enzyme Inhibition Constant Data from BindingDB
Found 1 hit for monomerid = 50010358
TargetDNA gyrase subunit B(Mycobacterium smegmatis)
Astrazeneca India
Curated by ChEMBL
LigandPNGBDBM50010358(CHEMBL3263602)
Affinity DataIC50:  500nM. Assay description: Inhibition of Mycobacterium smegmatis DNA gyrase B ATPase activity assessed as inorganic phosphate release using ATP as substrate by colorimetric ana...
In DepthDetails ArticlePubMed