BDBM50010447 8,8'-Bis-hydroxymethyl-5,5'-diisopropyl-1,1'-dimethoxy-3,3'-dimethyl-[2,2']binaphthalenyl-6,7,6',7'-tetraol::CHEMBL109497
SMILES COc1c(c(C)cc2c(C(C)C)c(O)c(O)c(CO)c12)-c1c(C)cc2c(C(C)C)c(O)c(O)c(CO)c2c1OC
InChI Key InChIKey=RIZZFSBARAUMFG-UHFFFAOYSA-N
Data  1 KI
  Tab Delimited (TSV)   2D SDfile   Computed 3D by Vconf -m prep SDfile
Find this compound or compounds like it in BindingDB:
Activity Spreadsheet -- Enzyme Inhibition Constant Data from BindingDB
Found 1 hit for monomerid = 50010447
TargetAldo-keto reductase family 1 member B1(Homo sapiens (Human))
University Of New Mexico School Of Medicine
Curated by ChEMBL
LigandPNGBDBM50010447(8,8'-Bis-hydroxymethyl-5,5'-diisopropyl-1,1'-dimet...)
Affinity DataKi:  4.30E+3nM. Assay description: The compound was tested for inhibitory activity against Aldose reductase from human placenta
In DepthDetails ArticlePubMed