BDBM50010480 CHEMBL3264008
SMILES CN[C@@H](C(C)C)C(=O)N[C@@H](Cc1ccc(O)cc1)C(=O)N[C@@H](Cc1ccc(O)cc1)P(O)(O)=O
InChI Key InChIKey=AFAFFSSNAUKMNO-HBMCJLEFSA-N
Data  3 IC50
  Tab Delimited (TSV)   2D SDfile   Computed 3D by Vconf -m prep SDfile
Find this compound or compounds like it in BindingDB:
Activity Spreadsheet -- Enzyme Inhibition Constant Data from BindingDB
Found 3 hits for monomerid = 50010480
TargetAngiotensin-converting enzyme(Oryctolagus cuniculus)
Vanderbilt University Department Of Chemistry
Curated by ChEMBL
LigandPNGBDBM50010480(CHEMBL3264008)
Affinity DataIC50:  140nM. Assay description: Inhibition of rabbit lung somatic ACE using FAPGG substrate
In DepthDetails ArticlePubMed
TargetAngiotensin-converting enzyme(Homo sapiens (Human))
Vanderbilt University Department Of Chemistry
Curated by ChEMBL
LigandPNGBDBM50010480(CHEMBL3264008)
Affinity DataIC50:  54nM. Assay description: Inhibition of human ACE N-terminal domain using Cbz-Phe-His-Leu-OH substrate
In DepthDetails ArticlePubMed
TargetAngiotensin-converting enzyme(Homo sapiens (Human))
Vanderbilt University Department Of Chemistry
Curated by ChEMBL
LigandPNGBDBM50010480(CHEMBL3264008)
Affinity DataIC50:  52nM. Assay description: Inhibition of human ACE C-terminal domain using Cbz-Phe-His-Leu-OH substrate
In DepthDetails ArticlePubMed