BDBM50010564 6-[3-(4-Acetylamino-phenoxy)-2-hydroxy-propylamino]-heptanoic acid p-tolylamide(S,R)::CHEMBL305051
SMILES C[C@H](CCCCC(=O)Nc1ccc(C)cc1)NC[C@H](O)COc1ccc(NC(C)=O)cc1
InChI Key InChIKey=MHHCJOYFYLUHFU-XXBNENTESA-N
Data  1 KI
  Tab Delimited (TSV)   2D SDfile   Computed 3D by Vconf -m prep SDfile
Find this compound or compounds like it in BindingDB:
Activity Spreadsheet -- Enzyme Inhibition Constant Data from BindingDB
Found 1 hit for monomerid = 50010564
TargetBeta-2 adrenergic receptor(Mus musculus)
University Of California
Curated by ChEMBL
LigandPNGBDBM50010564(6-[3-(4-Acetylamino-phenoxy)-2-hydroxy-propylamino...)
Affinity DataKi:  810nM. Assay description: Ki value was determined by accumulation of c-AMP in S-49 mouse lymphoma cells (Beta2).
In DepthDetails ArticlePubMed