BDBM50010659 CHEMBL3264748
SMILES [H][C@]12O[C@]34CC[C@@]5(OCOc6c(O)ccc7C[C@@]3([H])N(CC3CC3)CC[C@]4(c67)[C@]15[H])N(CCc1ccccc1)C2=O
InChI Key InChIKey=ASWPFFLMSHOYIM-NLIGWKNISA-N
Data  3 KI  6 EC50
  Tab Delimited (TSV)   2D SDfile   Computed 3D by Vconf -m prep SDfile
Find this compound or compounds like it in BindingDB:
Activity Spreadsheet -- Enzyme Inhibition Constant Data from BindingDB
Found 9 hits for monomerid = 50010659
TargetDelta-type opioid receptor(MOUSE)
Kitasato University
Curated by ChEMBL
LigandPNGBDBM50010659(CHEMBL3264748)
Affinity DataKi:  1.20nM. Assay description: Displacement of [3H]DPDPE from delta opioid receptor in mouse whole brain cerebellum membrane
In DepthDetails ArticlePubMed
TargetMu-type opioid receptor(MOUSE)
Kitasato University
Curated by ChEMBL
LigandPNGBDBM50010659(CHEMBL3264748)
Affinity DataKi:  1.80nM. Assay description: Displacement of [3H]DAMGO from mu opioid receptor in mouse whole brain cerebellum membrane
In DepthDetails ArticlePubMed
TargetKappa-type opioid receptor(Cavia porcellus (domestic guinea pig))
Kitasato University
Curated by ChEMBL
LigandPNGBDBM50010659(CHEMBL3264748)
Affinity DataKi:  1.90nM. Assay description: Displacement of [3H]U69593 from kappa opioid receptor in guinea pig cerebellum membrane
In DepthDetails ArticlePubMed
TargetMu-type opioid receptor(Homo sapiens (Human))
Kitasato University
Curated by ChEMBL
LigandPNGBDBM50010659(CHEMBL3264748)
Affinity DataEC50:  5.20nM. Assay description: Agonist activity at human mu opioid receptor expressed in HEK293 cells by CellKey method
In DepthDetails ArticlePubMed
TargetDelta-type opioid receptor(Homo sapiens (Human))
Kitasato University
Curated by ChEMBL
LigandPNGBDBM50010659(CHEMBL3264748)
Affinity DataEC50:  0.620nM. Assay description: Agonist activity at human delta opioid receptor expressed in HEK293 cells by CellKey method
In DepthDetails ArticlePubMed
TargetKappa-type opioid receptor(Homo sapiens (Human))
Kitasato University
Curated by ChEMBL
LigandPNGBDBM50010659(CHEMBL3264748)
Affinity DataEC50:  3.90nM. Assay description: Agonist activity at human kappa opioid receptor expressed in CHO cells assessed as [35S]-GTP[gammaS] binding
In DepthDetails ArticlePubMed
TargetKappa-type opioid receptor(Homo sapiens (Human))
Kitasato University
Curated by ChEMBL
LigandPNGBDBM50010659(CHEMBL3264748)
Affinity DataEC50:  2.40nM. Assay description: Agonist activity at human kappa opioid receptor expressed in HEK293 cells by CellKey method
In DepthDetails ArticlePubMed
TargetMu-type opioid receptor(Homo sapiens (Human))
Kitasato University
Curated by ChEMBL
LigandPNGBDBM50010659(CHEMBL3264748)
Affinity DataEC50:  2.10nM. Assay description: Agonist activity at human mu opioid receptor expressed in CHO cells assessed as [35S]-GTP[gammaS] binding
In DepthDetails ArticlePubMed
TargetDelta-type opioid receptor(Homo sapiens (Human))
Kitasato University
Curated by ChEMBL
LigandPNGBDBM50010659(CHEMBL3264748)
Affinity DataEC50:  0.410nM. Assay description: Agonist activity at human delta opioid receptor expressed in CHO cells assessed as [35S]-GTP[gammaS] binding
In DepthDetails ArticlePubMed