BDBM50010809 CHEMBL78928::N-(2-Iodo-phenyl)-N'-(2-styryl-phenyl)-guanidine
SMILES NC(Nc1ccccc1C=Cc1ccccc1)=Nc1ccccc1I
InChI Key InChIKey=UWASDHOKGCWWPG-UHFFFAOYSA-N
Data  1 IC50
  Tab Delimited (TSV)   2D SDfile   Computed 3D by Vconf -m prep SDfile
Find this compound or compounds like it in BindingDB:
Activity Spreadsheet -- Enzyme Inhibition Constant Data from BindingDB
Found 1 hit for monomerid = 50010809
TargetSigma non-opioid intracellular receptor 1(Homo sapiens (Human))
University Of Oregon
Curated by ChEMBL
LigandPNGBDBM50010809(CHEMBL78928 | N-(2-Iodo-phenyl)-N'-(2-styryl-pheny...)
Affinity DataIC50:  1.20E+3nM. Assay description: In vitro inhibitory activity against [3H]DTG binding to Sigma opioid receptor in guinea pig brain membrane homogenates
In DepthDetails ArticlePubMed