BDBM50010820 CHEMBL3264784
SMILES CC1(C)CC(CC(C)(C)N1)NC(=O)c1ccc(Oc2cccc(Cl)c2C#N)c(Cl)c1
InChI Key InChIKey=KEQNDTQSYJCIBP-UHFFFAOYSA-N
Data  1 IC50
  Tab Delimited (TSV)   2D SDfile   Computed 3D by Vconf -m prep SDfile
Find this compound or compounds like it in BindingDB:
Activity Spreadsheet -- Enzyme Inhibition Constant Data from BindingDB
Found 1 hit for monomerid = 50010820
TargetHistone-lysine N-methyltransferase EZH2(Homo sapiens (Human))
Constellation Pharmaceuticals
Curated by ChEMBL
LigandPNGBDBM50010820(CHEMBL3264784)
Affinity DataIC50:  140nM. Assay description: Inhibition of wild type EZH2 (unknown origin)
In DepthDetails ArticlePubMed