BDBM50010823 CHEMBL3264787
SMILES CC1(C)CC(CC(C)(C)N1)NC(=O)c1ccc(Oc2cccc(-c3ccnnc3)c2C#N)c(Cl)c1
InChI Key InChIKey=XLRMULHWFRKNQV-UHFFFAOYSA-N
Data  7 IC50  1 EC50
  Tab Delimited (TSV)   2D SDfile   Computed 3D by Vconf -m prep SDfile
Find this compound or compounds like it in BindingDB:
Activity Spreadsheet -- Enzyme Inhibition Constant Data from BindingDB
Found 8 hits for monomerid = 50010823
TargetHistone-lysine N-methyltransferase EZH2(Homo sapiens (Human))
Constellation Pharmaceuticals
Curated by ChEMBL
LigandPNGBDBM50010823(CHEMBL3264787)
Affinity DataIC50:  32nM. Assay description: Inhibition of wild type EZH2 (unknown origin)
In DepthDetails ArticlePubMed
TargetHistone-lysine N-methyltransferase EZH2(Homo sapiens (Human))
Constellation Pharmaceuticals
Curated by ChEMBL
LigandPNGBDBM50010823(CHEMBL3264787)
Affinity DataIC50:  5.83E+4nM. Assay description: Inhibition of EZH2 in human KARPAS422 cells assessed as global reduction in H3K27me3 level after 4 days by ELISA-based assay
In DepthDetails ArticlePubMed
TargetHistone-lysine N-methyltransferase EZH2(Homo sapiens (Human))
Constellation Pharmaceuticals
Curated by ChEMBL
LigandPNGBDBM50010823(CHEMBL3264787)
Affinity DataIC50:  1.34E+4nM. Assay description: Inhibition of EZH2 in human KARPAS422 cells assessed as global reduction in H3K27me3 level after 7 days by ELISA-based assay
In DepthDetails ArticlePubMed
TargetHistone-lysine N-methyltransferase EZH2(Homo sapiens (Human))
Constellation Pharmaceuticals
Curated by ChEMBL
LigandPNGBDBM50010823(CHEMBL3264787)
Affinity DataIC50:  320nM. Assay description: Inhibition of wild-type EZH2 (unknown origin)
In DepthDetails PubMed
TargetHistone-lysine N-methyltransferase EZH2(Homo sapiens (Human))
Constellation Pharmaceuticals
Curated by ChEMBL
LigandPNGBDBM50010823(CHEMBL3264787)
Affinity DataEC50:  7.00E+3nM. Assay description: Inhibition of EZH2 in human HeLa cells assessed as reduction of H3K27me3 and H3K27me2 level after 96 hrs by ELISA method
In DepthDetails ArticlePubMed
TargetHistone-lysine N-methyltransferase EZH2(Homo sapiens (Human))
Constellation Pharmaceuticals
Curated by ChEMBL
LigandPNGBDBM50010823(CHEMBL3264787)
Affinity DataIC50:  32nM. Assay description: Inhibition of EZH2 (unknown origin) using biotinylated nucleosome, H3K27me3 activator and [3H]-SAM incubated for 60 mins by top-count based method
In DepthDetails ArticlePubMed
TargetHistone-lysine N-methyltransferase EZH2(Homo sapiens (Human))
Constellation Pharmaceuticals
Curated by ChEMBL
LigandPNGBDBM50010823(CHEMBL3264787)
Affinity DataIC50:  0.0320nM. Assay description: Inhibition of EZH2 (unknown origin)
In DepthDetails PubMed
TargetHistone-lysine N-methyltransferase EZH2(Homo sapiens (Human))
Constellation Pharmaceuticals
Curated by ChEMBL
LigandPNGBDBM50010823(CHEMBL3264787)
Affinity DataIC50:  9.50E+3nM. Assay description: Inhibition of EZH2 in human KARPAS422 cells assessed as global reduction in H3K27me3 level after 10 days by ELISA-based assay
In DepthDetails ArticlePubMed