BDBM50010849 CHEMBL3264808
SMILES COc1cccc(c1)C(C)(C)NC[C@@H](O)[C@H](Cc1ccccc1)NC(=O)c1cc(cc(c1)C(=O)N1CCCC1)N1CCCCC1
InChI Key InChIKey=SDAMMIZBZDXUIC-SZAHLOSFSA-N
Data  3 IC50
  Tab Delimited (TSV)   2D SDfile   Computed 3D by Vconf -m prep SDfile
Find this compound or compounds like it in BindingDB:
Activity Spreadsheet -- Enzyme Inhibition Constant Data from BindingDB
Found 3 hits for monomerid = 50010849
TargetPlasmepsin II(Plasmodium falciparum)
Latvian Institute Of Organic Synthesis
Curated by ChEMBL
LigandPNGBDBM50010849(CHEMBL3264808)
Affinity DataIC50:  500nM. Assay description: Inhibition of Plasmodium falciparum plasmepsin-2 using DABCYL-Glu-Arg-Nle-Phe-Leu-Ser-Phe-Pro-EDANS as substrate preincubated for 30 mins by FRET ass...
In DepthDetails ArticlePubMed
TargetPlasmepsin I(Plasmodium falciparum)
Latvian Institute Of Organic Synthesis
Curated by ChEMBL
LigandPNGBDBM50010849(CHEMBL3264808)
Affinity DataIC50:  1.60E+3nM. Assay description: Inhibition of Plasmodium falciparum plasmepsin-1 using DABCYL-Glu-Arg-Nle-Phe-Leu-Ser-Phe-Pro-EDANS as substrate preincubated for 30 mins by FRET ass...
In DepthDetails ArticlePubMed
TargetCathepsin D(Homo sapiens (Human))
Latvian Institute Of Organic Synthesis
Curated by ChEMBL
LigandPNGBDBM50010849(CHEMBL3264808)
Affinity DataIC50:  38nM. Assay description: Inhibition of human cathepsin-D using DABCYL-Glu-Arg-Nle-Phe-Leu-Ser-Phe-Pro-EDANS as substrate preincubated for 30 mins by FRET assay
In DepthDetails ArticlePubMed