BDBM50010991 CHEMBL3259884
SMILES [N-]=[N+]=Nc1ccc(cc1)-c1nsc(=O)o1
InChI Key InChIKey=JQGYPMFXCALZQK-UHFFFAOYSA-N
Data  1 KI
  Tab Delimited (TSV)   2D SDfile   Computed 3D by Vconf -m prep SDfile
Find this compound or compounds like it in BindingDB:
Activity Spreadsheet -- Enzyme Inhibition Constant Data from BindingDB
Found 1 hit for monomerid = 50010991
TargetProteasome subunit beta type-8(Homo sapiens (Human))
Weill Cornell Medical College
Curated by ChEMBL
LigandPNGBDBM50010991(CHEMBL3259884)
Affinity DataKi:  3.50E+3nM. Assay description: Inhibition of immunoproteasome-20S subunit beta5i in human PBMC assessed as substrate hydrolysis using suc-LLVY-AMC as substrate measured for 120 min...
In DepthDetails ArticlePubMed