BDBM50011135 CHEMBL3259928
SMILES COc1cc(cc(SC)c1C(=O)N[C@]1(CCCN(C)C1)c1ccccc1)C(F)(F)F
InChI Key InChIKey=SCEGQLOWLADTKA-NRFANRHFSA-N
Data  4 IC50  3 EC50
  Tab Delimited (TSV)   2D SDfile   Computed 3D by Vconf -m prep SDfile
Find this compound or compounds like it in BindingDB:
Activity Spreadsheet -- Enzyme Inhibition Constant Data from BindingDB
Found 7 hits for monomerid = 50011135
TargetSodium- and chloride-dependent glycine transporter 1(Homo sapiens (Human))
F. Hoffmann-La Roche
Curated by ChEMBL
LigandPNGBDBM50011135(CHEMBL3259928)
Affinity DataEC50:  10nM. Assay description: Inhibition of human GlyT1 expressed in cells assessed as [3H]glycine uptake
In DepthDetails ArticlePubMed
TargetSodium- and chloride-dependent glycine transporter 1(Mus musculus)
F. Hoffmann-La Roche
Curated by ChEMBL
LigandPNGBDBM50011135(CHEMBL3259928)
Affinity DataEC50:  5nM. Assay description: Inhibition of mouse GlyT1
In DepthDetails ArticlePubMed
TargetCytochrome P450 2D6(Homo sapiens (Human))
F. Hoffmann-La Roche
Curated by ChEMBL
LigandPNGBDBM50011135(CHEMBL3259928)
Affinity DataIC50:  1.60E+4nM. Assay description: Inhibition of CYP2D6 (unknown origin)
In DepthDetails ArticlePubMed
TargetSodium- and chloride-dependent glycine transporter 2(Homo sapiens (Human))
F. Hoffmann-La Roche
Curated by ChEMBL
LigandPNGBDBM50011135(CHEMBL3259928)
Affinity DataEC50:  1.50E+4nM. Assay description: Inhibition of human GlyT2 expressed in cells assessed as [3H]glycine uptake
In DepthDetails ArticlePubMed
TargetCytochrome P450 3A4(Homo sapiens (Human))
F. Hoffmann-La Roche
Curated by ChEMBL
LigandPNGBDBM50011135(CHEMBL3259928)
Affinity DataIC50: >5.00E+4nM. Assay description: Inhibition of CYP3A4 (unknown origin)
In DepthDetails ArticlePubMed
TargetCytochrome P450 2C9(Homo sapiens (Human))
F. Hoffmann-La Roche
Curated by ChEMBL
LigandPNGBDBM50011135(CHEMBL3259928)
Affinity DataIC50: >5.00E+4nM. Assay description: Inhibition of CYP2C9 (unknown origin)
In DepthDetails ArticlePubMed
TargetCytochrome P450 2C19(Homo sapiens (Human))
F. Hoffmann-La Roche
Curated by ChEMBL
LigandPNGBDBM50011135(CHEMBL3259928)
Affinity DataIC50:  4.60E+4nM. Assay description: Inhibition of CYP2C19 (unknown origin)
In DepthDetails ArticlePubMed