BDBM50011343 CHEMBL3143477::Sodium; 2-{[7-(1-{[1-(2-hydroxy-1-isobutyl-5-methyl-4-{2-methyl-1-[(pyridin-2-ylmethyl)-carbamoyl]-butylcarbamoyl}-hexylcarbamoyl)-2-(3H-imidazol-4-yl)-ethyl]-methyl-carbamoyl}-2-phenyl-ethylcarbamoyl)-heptanoyl]-methyl-amino}-ethanesulfonate
SMILES [Na+].CC[C@H](C)[C@H](NC(=O)[C@@H](C[C@H](O)[C@H](CC(C)C)NC(=O)[C@H](Cc1c[nH]cn1)N(C)C(=O)[C@H](Cc1ccccc1)NC(=O)CCCCCCC(=O)N(C)CCS([O-])(=O)=O)C(C)C)C(=O)NCc1ccccn1
InChI Key InChIKey=RHXXYJCUIXRJCG-UHFFFAOYSA-M
Data  1 IC50
  Tab Delimited (TSV)   2D SDfile   Computed 3D by Vconf -m prep SDfile
Find this compound or compounds like it in BindingDB:
Activity Spreadsheet -- Enzyme Inhibition Constant Data from BindingDB
Found 1 hit for monomerid = 50011343
TargetRenin(Homo sapiens (Human))
Upjohn
Curated by ChEMBL
LigandPNGBDBM50011343(CHEMBL3143477 | Sodium; 2-{[7-(1-{[1-(2-hydroxy-1-...)
Affinity DataIC50:  0.660nM. Assay description: Inhibition of human plasma renin.
In DepthDetails ArticlePubMed