BDBM50011543 Ac-Phe(4-CH2CH2COOH)-Met-Gly-Trp-Met-Asp-Phe-NH2::CHEMBL2370120
SMILES CSCC[C@@H](NC(=O)[C@H](Cc1ccc(CCC(O)=O)cc1)NC(C)=O)C(=O)NCC(=O)N[C@@H](Cc1c[nH]c2ccccc12)C(=O)N[C@H](CCSC)C(=O)N[C@@H](CC(O)=O)C(=O)N[C@@H](Cc1ccccc1)C(N)=O
InChI Key InChIKey=CEQHJGFECVLIEB-CPIGRZJLSA-N
Data  2 IC50
  Tab Delimited (TSV)   2D SDfile   Computed 3D by Vconf -m prep SDfile
Find this compound or compounds like it in BindingDB:
Activity Spreadsheet -- Enzyme Inhibition Constant Data from BindingDB
Found 2 hits for monomerid = 50011543
TargetGastrin/cholecystokinin type B receptor(Bos taurus)
Roche Research Center
Curated by ChEMBL
LigandPNGBDBM50011543(Ac-Phe(4-CH2CH2COOH)-Met-Gly-Trp-Met-Asp-Phe-NH2 |...)
Affinity DataIC50:  620nM. Assay description: Inhibition of [3H]-propanoyl binding to cholecystokinin type B receptor subtype was determined in bovine striatum membranes
In DepthDetails ArticlePubMed
TargetCholecystokinin receptor type A(RAT)
Roche Research Center
Curated by ChEMBL
LigandPNGBDBM50011543(Ac-Phe(4-CH2CH2COOH)-Met-Gly-Trp-Met-Asp-Phe-NH2 |...)
Affinity DataIC50:  620nM. Assay description: Inhibition of [3H]-propanoyl binding to cholecystokinin type A receptor was determined in fresh rat pancreatic tissue membranes
In DepthDetails ArticlePubMed