BDBM50011906 CHEMBL287699::Hexanoic acid {4-amino-6-[4,6-diamino-3-(3-amino-6-aminomethyl-4,5-dihydroxy-tetrahydro-pyran-2-yloxy)-2-hydroxy-cyclohexyloxy]-3,5-dihydroxy-tetrahydro-pyran-2-ylmethyl}-butyl-amide
SMILES CCCCCC(=O)N(CCCC)CC1OC(OC2C(N)CC(N)C(OC3OC(CN)C(O)C(O)C3N)C2O)C(O)C(N)C1O
InChI Key InChIKey=RKWRBZOHODLUJS-UHFFFAOYSA-N
Data  1 IC50
  Tab Delimited (TSV)   2D SDfile   Computed 3D by Vconf -m prep SDfile
Find this compound or compounds like it in BindingDB:
Activity Spreadsheet -- Enzyme Inhibition Constant Data from BindingDB
Found 1 hit for monomerid = 50011906
TargetAcyl-protein thioesterase 1(Rattus norvegicus)
Universit£
Curated by ChEMBL
LigandPNGBDBM50011906(CHEMBL287699 | Hexanoic acid {4-amino-6-[4,6-diami...)
Affinity DataIC50:  1.10E+5nM. Assay description: In vitro inhibition of lysosomal phospholipase activity for release of labeled lysophosphatidylcholine
In DepthDetails ArticlePubMed