BDBM50011930 2-Cyano-3-(3,4-dihydroxy-phenyl)-acrylic acid 3-phenyl-propyl ester::CHEMBL35934
SMILES Oc1ccc(\C=C(/C#N)C(=O)OCCCc2ccccc2)cc1O
InChI Key InChIKey=HKRHZIHACCIQDM-LFIBNONCSA-N
Data  3 IC50
  Tab Delimited (TSV)   2D SDfile   Computed 3D by Vconf -m prep SDfile
Find this compound or compounds like it in BindingDB:
Activity Spreadsheet -- Enzyme Inhibition Constant Data from BindingDB
Found 3 hits for monomerid = 50011930
TargetPolyunsaturated fatty acid lipoxygenase ALOX15B(Rattus norvegicus)
Institute For Bio-Medical Research
Curated by ChEMBL
LigandPNGBDBM50011930(2-Cyano-3-(3,4-dihydroxy-phenyl)-acrylic acid 3-ph...)
Affinity DataIC50:  1.40E+3nM. Assay description: Inhibitory activity of the compound against 15-lipoxygenase in rat polymorphonuclear leukocytes
In DepthDetails ArticlePubMed
TargetPolyunsaturated fatty acid 5-lipoxygenase(Rattus norvegicus)
Institute For Bio-Medical Research
Curated by ChEMBL
LigandPNGBDBM50011930(2-Cyano-3-(3,4-dihydroxy-phenyl)-acrylic acid 3-ph...)
Affinity DataIC50:  160nM. Assay description: Inhibitory activity of the compound against 5-lipoxygenase in rat polymorphonuclear leukocytes
In DepthDetails ArticlePubMed
TargetPolyunsaturated fatty acid lipoxygenase ALOX15(Rattus norvegicus)
Institute For Bio-Medical Research
Curated by ChEMBL
LigandPNGBDBM50011930(2-Cyano-3-(3,4-dihydroxy-phenyl)-acrylic acid 3-ph...)
Affinity DataIC50:  53nM. Assay description: Inhibitory activity of the compound against 12-lipoxygenase in rat platelet rich plasma
In DepthDetails ArticlePubMed