BDBM50012104 CHEMBL3263666
SMILES Cc1nc(co1)C(=O)Nc1cc(ccc1N1CCN(CC1)c1ccccc1C)C(=O)NCCCN1CCCC1=O
InChI Key InChIKey=DLPONEIRGXTAOH-UHFFFAOYSA-N
Data  1 EC50
  Tab Delimited (TSV)   2D SDfile   Computed 3D by Vconf -m prep SDfile
Find this compound or compounds like it in BindingDB:
Activity Spreadsheet -- Enzyme Inhibition Constant Data from BindingDB
Found 1 hit for monomerid = 50012104
TargetFollicle-stimulating hormone receptor(Homo sapiens (Human))
Emd-Serono Research Institute
Curated by ChEMBL
LigandPNGBDBM50012104(CHEMBL3263666)
Affinity DataEC50:  2.50E+5nM. Assay description: Positive allosteric modulation of human FSH receptor expressed in CHO cells assessed as effect on FSH-induced cAMP accumulation after 1 hr by HTRF as...
In DepthDetails ArticlePubMed