BDBM50012223 5-{2-(4-Fluoro-phenyl)-1-[[2-(2-methoxy-ethoxy)-ethyl]-(2-methoxy-ethyl)-amino]-ethyl}-thieno[2,3-b]thiophene-2-sulfonic acid amide::CHEMBL50395
SMILES COCCOCCN(CCOC)C(Cc1ccc(F)cc1)c1cc2cc(sc2s1)S(N)(=O)=O
InChI Key InChIKey=GVVWJYWBLCXJJI-UHFFFAOYSA-N
Data  1 KI
  Tab Delimited (TSV)   2D SDfile   Computed 3D by Vconf -m prep SDfile
Find this compound or compounds like it in BindingDB:
Activity Spreadsheet -- Enzyme Inhibition Constant Data from BindingDB
Found 1 hit for monomerid = 50012223
TargetCarbonic anhydrase 2(Homo sapiens (Human))
Merck Sharp And Dohme Research Laboratories
Curated by ChEMBL
LigandPNGBDBM50012223(5-{2-(4-Fluoro-phenyl)-1-[[2-(2-methoxy-ethoxy)-et...)
Affinity DataKi:  7nM. Assay description: In vitro binding affinity against human carbonic anhydrase IIChecked by Author
In DepthDetails ArticlePubMed