BDBM50012233 5-Sulfamoyl-thieno[2,3-b]thiophene-2-carboxylic acid (2-thiomorpholin-4-yl-ethyl)-amide; hydrochloride::CHEMBL544731
SMILES NS(=O)(=O)c1cc2cc(sc2s1)C(=O)NCCN1CCSCC1
InChI Key InChIKey=FUGQZVNNDPTYJD-UHFFFAOYSA-N
Data  1 KI
  Tab Delimited (TSV)   2D SDfile   Computed 3D by Vconf -m prep SDfile
Find this compound or compounds like it in BindingDB:
Activity Spreadsheet -- Enzyme Inhibition Constant Data from BindingDB
Found 1 hit for monomerid = 50012233
TargetCarbonic anhydrase 2(Homo sapiens (Human))
Merck Sharp And Dohme Research Laboratories
Curated by ChEMBL
LigandPNGBDBM50012233(5-Sulfamoyl-thieno[2,3-b]thiophene-2-carboxylic ac...)
Affinity DataKi:  4nM. Assay description: In vitro binding affinity against human carbonic anhydrase IIChecked by Author
In DepthDetails ArticlePubMed