BDBM50012270 CHEMBL1093517
SMILES CCn1c2ccc(cc2c2ccccc2c1=O)C(O)(C(F)(F)F)C(F)(F)F
InChI Key InChIKey=LOPKZCKYRROVIE-UHFFFAOYSA-N
Data  4 IC50
  Tab Delimited (TSV)   2D SDfile   Computed 3D by Vconf -m prep SDfile
Find this compound or compounds like it in BindingDB:
Activity Spreadsheet -- Enzyme Inhibition Constant Data from BindingDB
Found 4 hits for monomerid = 50012270
TargetNuclear receptor ROR-alpha(Homo sapiens (Human))
The University Of Tokyo
Curated by ChEMBL
LigandPNGBDBM50012270(CHEMBL1093517)
Affinity DataIC50: >2.00E+4nM. Assay description: Inverse agonist activity at human ROR-alpha1 expressed in HEK293 cells after 16 hrs by luciferase reporter gene assay
In DepthDetails ArticlePubMed
TargetProgesterone receptor(Homo sapiens (Human))
The University Of Tokyo
Curated by ChEMBL
LigandPNGBDBM50012270(CHEMBL1093517)
Affinity DataIC50:  1.40E+3nM. Assay description: Antagonist activity at PR in human T47D cells assessed as inhibition of progesterone-induced alkaline phosphatase activity measured after 24 hrs
In DepthDetails ArticlePubMed
TargetNuclear receptor ROR-gamma(Homo sapiens (Human))
The University Of Tokyo
Curated by ChEMBL
LigandPNGBDBM50012270(CHEMBL1093517)
Affinity DataIC50: >2.00E+4nM. Assay description: Inverse agonist activity at human ROR-gamma1 expressed in HEK293 cells after 16 hrs by luciferase reporter gene assay
In DepthDetails ArticlePubMed
TargetNuclear receptor ROR-beta(Homo sapiens (Human))
The University Of Tokyo
Curated by ChEMBL
LigandPNGBDBM50012270(CHEMBL1093517)
Affinity DataIC50: >2.00E+4nM. Assay description: Inverse agonist activity at human ROR-beta expressed in HEK293 cells after 16 hrs by luciferase reporter gene assay
In DepthDetails ArticlePubMed