BDBM50012280 CHEMBL3260030
SMILES CCCCCCCCCCCCCCC\C(NCc1cccc(C)c1)=C1\C(=O)OC(CO)C1=O
InChI Key InChIKey=OEECGLYZTWBFHW-RFBIWTDZSA-N
Data  2 IC50
  Tab Delimited (TSV)   2D SDfile   Computed 3D by Vconf -m prep SDfile
Find this compound or compounds like it in BindingDB:
Activity Spreadsheet -- Enzyme Inhibition Constant Data from BindingDB
Found 2 hits for monomerid = 50012280
TargetDual specificity protein phosphatase 3(Homo sapiens (Human))
Japan Science And Technology Agency
Curated by ChEMBL
LigandPNGBDBM50012280(CHEMBL3260030)
Affinity DataIC50:  1.60E+3nM. Assay description: Inhibition of Vaccinia H1-related phosphatase (unknown origin) by fluorescence emission assay
In DepthDetails ArticlePubMed
TargetDual specificity protein phosphatase 3(Homo sapiens (Human))
Japan Science And Technology Agency
Curated by ChEMBL
LigandPNGBDBM50012280(CHEMBL3260030)
Affinity DataIC50: >1.00E+5nM. Assay description: Inhibition of Vaccinia H1-related phosphatase (unknown origin) by fluorescence emission assay in presence of 0.001% NP-40
In DepthDetails ArticlePubMed