BDBM50012733 2-(4-Methanesulfonyl-benzyl)-naphthalen-1-ol::CHEMBL123003
SMILES CS(=O)(=O)c1ccc(Cc2ccc3ccccc3c2O)cc1
InChI Key InChIKey=WBSLDVIWBFLMCJ-UHFFFAOYSA-N
Data  2 IC50
  Tab Delimited (TSV)   2D SDfile   Computed 3D by Vconf -m prep SDfile
Find this compound or compounds like it in BindingDB:
Activity Spreadsheet -- Enzyme Inhibition Constant Data from BindingDB
Found 2 hits for monomerid = 50012733
TargetPolyunsaturated fatty acid 5-lipoxygenase(Rattus norvegicus)TBA
LigandPNGBDBM50012733(2-(4-Methanesulfonyl-benzyl)-naphthalen-1-ol | CHE...)
Affinity DataIC50:  240nM. Assay description: Inhibition of 5-lipoxygenase in Rattus norvegicus Rat basophil leukemia cells (RBL) cells
In DepthDetails Article
TargetPolyunsaturated fatty acid 5-lipoxygenase(Rattus norvegicus)TBA
LigandPNGBDBM50012733(2-(4-Methanesulfonyl-benzyl)-naphthalen-1-ol | CHE...)
Affinity DataIC50:  240nM. Assay description: Ability to inhibit 5-lipoxygenase by using a crude preparation of the cytosolic enzyme from the rat basophilic leukemia (RBL-1) cell line
In DepthDetails ArticlePubMed