BDBM50012982 3-(3-Pyrrolidin-1-yl-bicyclo[2.2.2]oct-5-en-2-yl)-1H-indole::CHEMBL341326
SMILES C1CCN(C1)C1C2CCC(C=C2)C1c1c[nH]c2ccccc12
InChI Key InChIKey=QSYOYDXUQCIZDG-UHFFFAOYSA-N
Data  3 KI  4 IC50
  Tab Delimited (TSV)   2D SDfile   Computed 3D by Vconf -m prep SDfile
Find this compound or compounds like it in BindingDB:
Activity Spreadsheet -- Enzyme Inhibition Constant Data from BindingDB
Found 7 hits for monomerid = 50012982
Target5-hydroxytryptamine receptor 1A(Mus musculus (Mouse))
Polytechnic University
Curated by ChEMBL
LigandPNGBDBM50012982(3-(3-Pyrrolidin-1-yl-bicyclo[2.2.2]oct-5-en-2-yl)-...)
Affinity DataKi:  8.50E+3nM. Assay description: Binding affinity towards 5-hydroxytryptamine 1A receptor by the displacement of [3H]8-OH-DPAT in mouse hippocampus
In DepthDetails ArticlePubMed
Target5-hydroxytryptamine receptor 2A/2B/2C(Mus musculus (Mouse))
Polytechnic University
Curated by ChEMBL
LigandPNGBDBM50012982(3-(3-Pyrrolidin-1-yl-bicyclo[2.2.2]oct-5-en-2-yl)-...)
Affinity DataKi:  1.70E+4nM. Assay description: Binding affinity towards 5-hydroxytryptamine 2 receptor by the displacement of [3H]-ketanserin in mouse cerebral cortex
In DepthDetails ArticlePubMed
Target5-hydroxytryptamine receptor 2A/2B/2C(Mus musculus (Mouse))
Polytechnic University
Curated by ChEMBL
LigandPNGBDBM50012982(3-(3-Pyrrolidin-1-yl-bicyclo[2.2.2]oct-5-en-2-yl)-...)
Affinity DataKi:  1.70E+4nM. Assay description: Binding affinity towards 5-hydroxytryptamine 2 receptor by the displacement of [3H]-ketanserin in mouse cerebral cortex
In DepthDetails ArticlePubMed
Target5-hydroxytryptamine receptor 2A/2B/2C(Mus musculus (Mouse))
Polytechnic University
Curated by ChEMBL
LigandPNGBDBM50012982(3-(3-Pyrrolidin-1-yl-bicyclo[2.2.2]oct-5-en-2-yl)-...)
Affinity DataIC50:  2.40E+4nM. Assay description: Inhibitory activity towards 5-hydroxytryptamine 1A receptor by the displacement of [3H]-8-OH-DPAT in mouse hippocampus
In DepthDetails ArticlePubMed
Target5-hydroxytryptamine receptor 2A/2B/2C(Mus musculus (Mouse))
Polytechnic University
Curated by ChEMBL
LigandPNGBDBM50012982(3-(3-Pyrrolidin-1-yl-bicyclo[2.2.2]oct-5-en-2-yl)-...)
Affinity DataIC50:  2.40E+4nM. Assay description: Binding affinity towards 5-hydroxytryptamine 1A receptor by the displacement of [3H]8-OH-DPAT in mouse hippocampus
In DepthDetails ArticlePubMed
Target5-hydroxytryptamine receptor 1A(Mus musculus (Mouse))
Polytechnic University
Curated by ChEMBL
LigandPNGBDBM50012982(3-(3-Pyrrolidin-1-yl-bicyclo[2.2.2]oct-5-en-2-yl)-...)
Affinity DataIC50:  4.70E+4nM. Assay description: Inhibitory activity towards 5-hydroxytryptamine 1A receptor by the displacement of [3H]-8-OH-DPAT in mouse hippocampus
In DepthDetails ArticlePubMed
Target5-hydroxytryptamine receptor 1A(Mus musculus (Mouse))
Polytechnic University
Curated by ChEMBL
LigandPNGBDBM50012982(3-(3-Pyrrolidin-1-yl-bicyclo[2.2.2]oct-5-en-2-yl)-...)
Affinity DataIC50:  4.70E+4nM. Assay description: Inhibitory activity towards 5-hydroxytryptamine 1A receptor by the displacement of [3H]8-OH-DPAT in mouse hippocampus
In DepthDetails ArticlePubMed