BDBM50013067 CHEMBL3261707
SMILES COc1ccc(cc1Cl)C(=O)Nc1ccc(OC(CCN(C)C)c2ccccc2)cc1
InChI Key InChIKey=DXAJRWYUVQJPNE-UHFFFAOYSA-N
Data  2 KI
  Tab Delimited (TSV)   2D SDfile   Computed 3D by Vconf -m prep SDfile
Find this compound or compounds like it in BindingDB:
Activity Spreadsheet -- Enzyme Inhibition Constant Data from BindingDB
Found 2 hits for monomerid = 50013067
TargetSodium-dependent serotonin transporter(Rattus norvegicus (rat))
Gedeon Richter
Curated by ChEMBL
LigandPNGBDBM50013067(CHEMBL3261707)
Affinity DataKi:  16nM. Assay description: Displacement of [3H]citalopram from SERT in Sprague-Dawley rat whole brain membranes after 1 hr by liquid scintillation spectrophotometric analysis
In DepthDetails ArticlePubMed
Target5-hydroxytryptamine receptor 2C(Rattus norvegicus (Rat))
Gedeon Richter
Curated by ChEMBL
LigandPNGBDBM50013067(CHEMBL3261707)
Affinity DataKi:  152nM. Assay description: Displacement of [3H]mesulergine from 5-HT2C receptor in Sprague-Dawley rat choroid plexus membranes after 30 mins by liquid scintillation spectrophot...
In DepthDetails ArticlePubMed