BDBM50013117 CHEMBL3261691
SMILES CN(C)CCC(Oc1ccc(NC(=O)Nc2ccc3nccn3c2)cc1)c1ccccc1
InChI Key InChIKey=PIUGPTIKIKDWFL-UHFFFAOYSA-N
Data  1 KI
  Tab Delimited (TSV)   2D SDfile   Computed 3D by Vconf -m prep SDfile
Find this compound or compounds like it in BindingDB:
Activity Spreadsheet -- Enzyme Inhibition Constant Data from BindingDB
Found 1 hit for monomerid = 50013117
TargetSodium-dependent serotonin transporter(Rattus norvegicus (rat))
Gedeon Richter
Curated by ChEMBL
LigandPNGBDBM50013117(CHEMBL3261691)
Affinity DataKi:  4nM. Assay description: Displacement of [3H]citalopram from SERT in Sprague-Dawley rat whole brain membranes after 1 hr by liquid scintillation spectrophotometric analysis
In DepthDetails ArticlePubMed