BDBM50013153 CHEMBL3262343
SMILES CC(C)(O)c1cn(nn1)-c1ccc(Cl)c(c1)C(F)(F)F
InChI Key InChIKey=GVJAYGCCKFHJBX-UHFFFAOYSA-N
Data  1 IC50
  Tab Delimited (TSV)   2D SDfile   Computed 3D by Vconf -m prep SDfile
Find this compound or compounds like it in BindingDB:
Activity Spreadsheet -- Enzyme Inhibition Constant Data from BindingDB
Found 1 hit for monomerid = 50013153
TargetAndrogen receptor(Homo sapiens (Human))
Deakin University
Curated by ChEMBL
LigandPNGBDBM50013153(CHEMBL3262343)
Affinity DataIC50:  4.90E+4nM. Assay description: Antagonist activity at androgen receptor in human LNCAP cells assessed as inhibition of androgen-stimulated cell growth measured every 3 days
In DepthDetails ArticlePubMed