BDBM50013315 CHEMBL3263030
SMILES COC(=O)c1ccc(CN2CCN(CC2)c2ccc(OC(C)C)c(NC(=O)c3cnccn3)c2)cc1
InChI Key InChIKey=VEOSOVNOHIBZSV-UHFFFAOYSA-N
Data  1 IC50
  Tab Delimited (TSV)   2D SDfile   Computed 3D by Vconf -m prep SDfile
Find this compound or compounds like it in BindingDB:
Activity Spreadsheet -- Enzyme Inhibition Constant Data from BindingDB
Found 1 hit for monomerid = 50013315
TargetC-C chemokine receptor type 5(Homo sapiens (Human))
Virginia Commonwealth University
Curated by ChEMBL
LigandPNGBDBM50013315(CHEMBL3263030)
Affinity DataIC50:  9.80E+3nM. Assay description: Antagonist activity at CCR5 (unknown origin) expressed in human MOLT4 cells assessed as inhibition of RANTES-stimulated calcium mobilization treated ...
In DepthDetails ArticlePubMed