BDBM50013885 CHEMBL3260035
SMILES COc1c(SCC(O)=O)cc(NS(=O)(=O)c2ccc(Br)cc2)c2ccccc12
InChI Key InChIKey=GKYKQIMOHSMRSO-UHFFFAOYSA-N
Data  1 KI  1 IC50
  Tab Delimited (TSV)   2D SDfile   Computed 3D by Vconf -m prep SDfile
Find this compound or compounds like it in BindingDB:
Activity Spreadsheet -- Enzyme Inhibition Constant Data from BindingDB
Found 2 hits for monomerid = 50013885
TargetInduced myeloid leukemia cell differentiation protein Mcl-1(Homo sapiens (Human))
University Of Michigan Medical School
Curated by ChEMBL
LigandPNGBDBM50013885(CHEMBL3260035)
Affinity DataKi:  8.70E+4nM. Assay description: Displacement of Flu-BID/FAM-BID from His-tagged MCL1 (171 to 327) (unknown origin) expressed in Escherichia coli BL21(DE3) after 3 hrs by fluorescenc...
In DepthDetails ArticlePubMed
TargetInduced myeloid leukemia cell differentiation protein Mcl-1(Homo sapiens (Human))
University Of Michigan Medical School
Curated by ChEMBL
LigandPNGBDBM50013885(CHEMBL3260035)
Affinity DataIC50: >1.00E+5nM. Assay description: Binding affinity to His-tagged MCL1 (171 to 327) (unknown origin) expressed in Escherichia coli BL21(DE3) assessed as inhibition of MCL1-N-terminal b...
In DepthDetails ArticlePubMed