BDBM50014114 (1-{5-Amino-1-[1-(1-ethylcarbamoyl-3-methyl-butylcarbamoyl)-2-(1H-indol-3-yl)-ethylcarbamoyl]-pentyl}-3-benzyl-2,5,9-trioxo-[1,4]diazonan-6-yl)-carbamic acid benzyl ester::CHEMBL315568
SMILES CCNC(=O)[C@H](CC(C)C)NC(=O)[C@H](Cc1c[nH]c2ccccc12)NC(=O)[C@H](CCCCN)n1c(O)ccc(NC(O)OCc2ccccc2)c(=O)[nH]c(Cc2ccccc2)c1O
InChI Key InChIKey=ZPUXYNMXHQIJAW-FABCCELGSA-N
Data  1 IC50
  Tab Delimited (TSV)   2D SDfile   Computed 3D by Vconf -m prep SDfile
Find this compound or compounds like it in BindingDB:
Activity Spreadsheet -- Enzyme Inhibition Constant Data from BindingDB
Found 1 hit for monomerid = 50014114
TargetRenin(Homo sapiens (Human))
Ici Pharmaceuticals Group
Curated by ChEMBL
LigandPNGBDBM50014114((1-{5-Amino-1-[1-(1-ethylcarbamoyl-3-methyl-butylc...)
Affinity DataIC50:  850nM. Assay description: Inhibitory activity against human renin
In DepthDetails ArticlePubMed