BDBM50014117 2-{2-[2-[6-Amino-2-(3-benzyl-6-benzyloxycarbonylamino-2,5,9-trioxo-[1,4]diazonan-1-yl)-hexanoylamino]-3-(1H-indol-3-yl)-propionylamino]-4-methyl-pentanoylamino}-malonic acid dimethyl ester::CHEMBL405269
SMILES COC(=O)C(NC(=O)[C@H](CC(C)C)NC(=O)[C@H](Cc1c[nH]c2ccccc12)NC(=O)[C@H](CCCCN)n1c(O)ccc(NC(O)OCc2ccccc2)c(=O)[nH]c(Cc2ccccc2)c1O)C(=O)OC
InChI Key InChIKey=MSEUGHRAKBZSLP-HMFXBENSSA-N
Data  2 IC50
  Tab Delimited (TSV)   2D SDfile   Computed 3D by Vconf -m prep SDfile
Find this compound or compounds like it in BindingDB:
Activity Spreadsheet -- Enzyme Inhibition Constant Data from BindingDB
Found 2 hits for monomerid = 50014117
TargetRenin(Homo sapiens (Human))
Ici Pharmaceuticals Group
Curated by ChEMBL
LigandPNGBDBM50014117(2-{2-[2-[6-Amino-2-(3-benzyl-6-benzyloxycarbonylam...)
Affinity DataIC50:  1.10E+3nM. Assay description: Inhibitory activity against porcine renin
In DepthDetails ArticlePubMed
TargetRenin(Homo sapiens (Human))
Ici Pharmaceuticals Group
Curated by ChEMBL
LigandPNGBDBM50014117(2-{2-[2-[6-Amino-2-(3-benzyl-6-benzyloxycarbonylam...)
Affinity DataIC50:  400nM. Assay description: Inhibitory activity against human renin
In DepthDetails ArticlePubMed