BDBM50014185 2-(3-Carboxy-acryloylamino)-pentanedioic acid::CHEMBL91685
SMILES OC(=O)CC[C@H](NC(=O)\C=C\C(O)=O)C(O)=O
InChI Key InChIKey=GEFVNCTULMSKRF-FYTLMZHYSA-N
Data  1 KI  1 IC50
  Tab Delimited (TSV)   2D SDfile   Computed 3D by Vconf -m prep SDfile
Find this compound or compounds like it in BindingDB:
Activity Spreadsheet -- Enzyme Inhibition Constant Data from BindingDB
Found 2 hits for monomerid = 50014185
TargetGlutamate carboxypeptidase 2(Rattus norvegicus)
University Of Minnesota
Curated by ChEMBL
LigandPNGBDBM50014185(2-(3-Carboxy-acryloylamino)-pentanedioic acid | CH...)
Affinity DataKi:  400nM. Assay description: Tested for Ac-Asp-[3,4-3H]-Glu-OH hydrolysis inhibitory activity against rat fore-brain N-acetylated-alpha-linked acidic dipeptidase
In DepthDetails ArticlePubMed
TargetGlutamate carboxypeptidase 2(Rattus norvegicus)
University Of Minnesota
Curated by ChEMBL
LigandPNGBDBM50014185(2-(3-Carboxy-acryloylamino)-pentanedioic acid | CH...)
Affinity DataIC50:  800nM. Assay description: Concentration required for 50%inhibition of Ac-Asp-[3,4-3H]-Glu-OH hydrolysis against rat fore-brain N-acetylated-alpha-linked acidic dipeptidase
In DepthDetails ArticlePubMed