BDBM50014441 CHEMBL3261414
SMILES C[C@@H](CNc1cccc2n(ncc12)-c1ccc(F)c(C)c1)NS(=O)(=O)c1c(C)cc(C)cc1C
InChI Key InChIKey=PSMGISUWNBDOLL-FQEVSTJZSA-N
Data  3 IC50
  Tab Delimited (TSV)   2D SDfile   Computed 3D by Vconf -m prep SDfile
Find this compound or compounds like it in BindingDB:
Activity Spreadsheet -- Enzyme Inhibition Constant Data from BindingDB
Found 3 hits for monomerid = 50014441
TargetGlucocorticoid receptor(Homo sapiens (Human))
Astrazeneca
Curated by ChEMBL
LigandPNGBDBM50014441(CHEMBL3261414)
Affinity DataIC50:  23nM. Assay description: Agonist activity at glucocorticoid receptor in human PBMC assessed as inhibition of LPS-stimulated TNF-alpha release
In DepthDetails ArticlePubMed
TargetGlucocorticoid receptor(Homo sapiens (Human))
Astrazeneca
Curated by ChEMBL
LigandPNGBDBM50014441(CHEMBL3261414)
Affinity DataIC50:  14nM. Assay description: Agonist activity at glucocorticoid receptor in human Chago K1 cells assessed as gene transrepression by Lac-Z reporter gene assay
In DepthDetails ArticlePubMed
TargetGlucocorticoid receptor(Homo sapiens (Human))
Astrazeneca
Curated by ChEMBL
LigandPNGBDBM50014441(CHEMBL3261414)
Affinity DataIC50:  4.10nM. Assay description: Binding affinity to human glucocorticoid receptor by fluorescence polarization assay
In DepthDetails ArticlePubMed