BDBM50014708 CHEMBL3262017::US10759791, Compound 3S::US9951014, Name 3S
SMILES Cc1cc(N)nc(CCc2cccc(c2)[C@@H](N)Cc2cc(C)cc(N)n2)c1
InChI Key InChIKey=HPGDXHOKQNTRIC-FQEVSTJZSA-N
Data  9 KI
PDB links: 1 PDB ID matches this monomer.
  Tab Delimited (TSV)   2D SDfile   Computed 3D by Vconf -m prep SDfile
Find this compound or compounds like it in BindingDB:
Activity Spreadsheet -- Enzyme Inhibition Constant Data from BindingDB
Found 9 hits for monomerid = 50014708
TargetNitric oxide synthase, brain(Homo sapiens (Human))
Northwestern University
US Patent
LigandPNGBDBM50014708(CHEMBL3262017 | US10759791, Compound 3S | US995101...)
Affinity DataKi:  144nM. Assay description: The NOSs isoform assays involved subjecting 3-8 to an oxyhemoglobin NO capture assay using a Biotek Gen5™ microplate reader. IC50 values for each com...
TargetNitric oxide synthase, brain(Rattus norvegicus (rat))
Northwestern University
Curated by ChEMBL
LigandPNGBDBM50014708(CHEMBL3262017 | US10759791, Compound 3S | US995101...)
Affinity DataKi:  144nM. Assay description: Inhibition of purified rat nNOS assessed as inhibition of nitric oxide-mediated oxidation of hemoglobin-A by hemoglobin capture assay
TargetNitric oxide synthase, brain(Rattus norvegicus (rat))
Northwestern University
Curated by ChEMBL
LigandPNGBDBM50014708(CHEMBL3262017 | US10759791, Compound 3S | US995101...)
Affinity DataKi:  144nM. Assay description: Enzyme inhibition was evaluated by measuring NO production with the hemoglobin capture assay, which was performed with purified NOSs in 96-well plate...
TargetNitric oxide synthase, inducible(Mus musculus (mouse))
Northwestern University
Curated by ChEMBL
LigandPNGBDBM50014708(CHEMBL3262017 | US10759791, Compound 3S | US995101...)
Affinity DataKi:  1.77E+4nM. Assay description: Inhibition of purified mouse iNOS assessed as inhibition of nitric oxide-mediated oxidation of hemoglobin-A by hemoglobin capture assay
In DepthDetails ArticlePubMed
TargetNitric oxide synthase, inducible(Homo sapiens (Human))
Northwestern University
US Patent
LigandPNGBDBM50014708(CHEMBL3262017 | US10759791, Compound 3S | US995101...)
Affinity DataKi:  1.77E+4nM. Assay description: The NOSs isoform assays involved subjecting 3-8 to an oxyhemoglobin NO capture assay using a Biotek Gen5™ microplate reader. IC50 values for each com...
In DepthDetails US Patent
TargetNitric oxide synthase, inducible(Mus musculus (mouse))
Northwestern University
Curated by ChEMBL
LigandPNGBDBM50014708(CHEMBL3262017 | US10759791, Compound 3S | US995101...)
Affinity DataKi:  1.77E+4nM. Assay description: Enzyme inhibition was evaluated by measuring NO production with the hemoglobin capture assay, which was performed with purified NOSs in 96-well plate...
In DepthDetails US Patent
TargetNitric oxide synthase, endothelial(Bos taurus (bovine))
Northwestern University
Curated by ChEMBL
LigandPNGBDBM50014708(CHEMBL3262017 | US10759791, Compound 3S | US995101...)
Affinity DataKi:  7.09E+4nM. Assay description: Inhibition of purified bovine eNOS assessed as inhibition of nitric oxide-mediated oxidation of hemoglobin-A by hemoglobin capture assay
In DepthDetails ArticlePubMed
TargetNitric oxide synthase, endothelial(Homo sapiens (Human))
Northwestern University
US Patent
LigandPNGBDBM50014708(CHEMBL3262017 | US10759791, Compound 3S | US995101...)
Affinity DataKi:  7.09E+4nM. Assay description: The NOSs isoform assays involved subjecting 3-8 to an oxyhemoglobin NO capture assay using a Biotek Gen5™ microplate reader. IC50 values for each com...
In DepthDetails US Patent
TargetNitric oxide synthase, endothelial(Bos taurus (bovine))
Northwestern University
Curated by ChEMBL
LigandPNGBDBM50014708(CHEMBL3262017 | US10759791, Compound 3S | US995101...)
Affinity DataKi:  7.09E+4nM. Assay description: Enzyme inhibition was evaluated by measuring NO production with the hemoglobin capture assay, which was performed with purified NOSs in 96-well plate...
In DepthDetails US Patent